Information card for entry 4343498
Common name | Pd(h2-N,O-p-Me-C6H4NO)(CNArDipp2)2 |
Formula | C75 H87 N3 O Pd |
Calculated formula | C75 H87 N3 O Pd |
Title of publication | Solution Dynamics of Redox Noninnocent Nitrosoarene Ligands: Mapping the Electronic Criteria for the Formation of Persistent Metal-Coordinated Nitroxide Radicals. |
Authors of publication | Barnett, Brandon R.; Labios, Liezel A.; Moore, Curtis E.; England, Jason; Rheingold, Arnold L.; Wieghardt, Karl; Figueroa, Joshua S. |
Journal of publication | Inorganic chemistry |
Year of publication | 2015 |
Journal volume | 54 |
Journal issue | 14 |
Pages of publication | 7110 - 7121 |
a | 14.2644 ± 0.0008 Å |
b | 20.3118 ± 0.0008 Å |
c | 22.2729 ± 0.001 Å |
α | 90° |
β | 96.404 ± 0.003° |
γ | 90° |
Cell volume | 6413 ± 0.5 Å3 |
Cell temperature | 90 ± 2 K |
Ambient diffraction temperature | 90 K |
Number of distinct elements | 5 |
Space group number | 9 |
Hermann-Mauguin space group symbol | C 1 c 1 |
Hall space group symbol | C -2yc |
Residual factor for all reflections | 0.043 |
Residual factor for significantly intense reflections | 0.0367 |
Weighted residual factors for significantly intense reflections | 0.0995 |
Weighted residual factors for all reflections included in the refinement | 0.1254 |
Goodness-of-fit parameter for all reflections included in the refinement | 1.208 |
Diffraction radiation probe | x-ray |
Diffraction radiation wavelength | 0.71073 Å |
Diffraction radiation type | MoKα |