Information card for entry 4343499
Common name | OCNArDipp2 |
Formula | C32 H39 Cl2 N O |
Calculated formula | C32 H39 Cl2 N O |
SMILES | C(=Nc1c(cccc1c1c(cccc1C(C)C)C(C)C)c1c(cccc1C(C)C)C(C)C)=O.C(Cl)Cl |
Title of publication | Solution Dynamics of Redox Noninnocent Nitrosoarene Ligands: Mapping the Electronic Criteria for the Formation of Persistent Metal-Coordinated Nitroxide Radicals. |
Authors of publication | Barnett, Brandon R.; Labios, Liezel A.; Moore, Curtis E.; England, Jason; Rheingold, Arnold L.; Wieghardt, Karl; Figueroa, Joshua S. |
Journal of publication | Inorganic chemistry |
Year of publication | 2015 |
Journal volume | 54 |
Journal issue | 14 |
Pages of publication | 7110 - 7121 |
a | 18.3452 ± 0.0003 Å |
b | 8.2117 ± 0.0001 Å |
c | 20.3727 ± 0.0003 Å |
α | 90° |
β | 104.632 ± 0.001° |
γ | 90° |
Cell volume | 2969.52 ± 0.08 Å3 |
Cell temperature | 100 ± 2 K |
Ambient diffraction temperature | 100 K |
Number of distinct elements | 5 |
Space group number | 14 |
Hermann-Mauguin space group symbol | P 1 21/n 1 |
Hall space group symbol | -P 2yn |
Residual factor for all reflections | 0.041 |
Residual factor for significantly intense reflections | 0.0352 |
Weighted residual factors for significantly intense reflections | 0.0903 |
Weighted residual factors for all reflections included in the refinement | 0.0958 |
Goodness-of-fit parameter for all reflections included in the refinement | 1.036 |
Diffraction radiation probe | x-ray |
Diffraction radiation wavelength | 1.54178 Å |
Diffraction radiation type | CuKα |