Information card for entry 4343500
Common name | [Pd(PhNO)(CNArDipp2)]3 |
Formula | C111 H126 N6 O3 Pd3 |
Calculated formula | C111 H126 N6 O3 Pd3 |
Title of publication | Solution Dynamics of Redox Noninnocent Nitrosoarene Ligands: Mapping the Electronic Criteria for the Formation of Persistent Metal-Coordinated Nitroxide Radicals. |
Authors of publication | Barnett, Brandon R.; Labios, Liezel A.; Moore, Curtis E.; England, Jason; Rheingold, Arnold L.; Wieghardt, Karl; Figueroa, Joshua S. |
Journal of publication | Inorganic chemistry |
Year of publication | 2015 |
Journal volume | 54 |
Journal issue | 14 |
Pages of publication | 7110 - 7121 |
a | 17.368 ± 0.003 Å |
b | 18.616 ± 0.003 Å |
c | 30.754 ± 0.006 Å |
α | 90° |
β | 97.594 ± 0.009° |
γ | 90° |
Cell volume | 9856 ± 3 Å3 |
Cell temperature | 100 ± 2 K |
Ambient diffraction temperature | 100 K |
Number of distinct elements | 5 |
Space group number | 14 |
Hermann-Mauguin space group symbol | P 1 21/c 1 |
Hall space group symbol | -P 2ybc |
Residual factor for all reflections | 0.0933 |
Residual factor for significantly intense reflections | 0.085 |
Weighted residual factors for significantly intense reflections | 0.2057 |
Weighted residual factors for all reflections included in the refinement | 0.2133 |
Goodness-of-fit parameter for all reflections included in the refinement | 1.137 |
Diffraction radiation probe | x-ray |
Diffraction radiation wavelength | 1.54184 Å |
Diffraction radiation type | CuKα |