Information card for entry 4343526
Formula | C32 H80 O4 Si8 Yb |
Calculated formula | C32 H80 O4 Si8 Yb |
SMILES | [Yb]1([Si]([Si]([Si]([Si]1([Si](C)(C)C)[Si](C)(C)C)(C)C)(C)C)([Si](C)(C)C)[Si](C)(C)C)([O]1CCCC1)([O]1CCCC1)([O]1CCCC1)[O]1CCCC1 |
Title of publication | Neutral "Cp-Free" Silyl-Lanthanide(II) Complexes: Synthesis, Structure, and Bonding Analysis. |
Authors of publication | Zitz, Rainer; Hlina, Johann; Gatterer, Karl; Marschner, Christoph; Szilvási, Tibor; Baumgartner, Judith |
Journal of publication | Inorganic chemistry |
Year of publication | 2015 |
Journal volume | 54 |
Journal issue | 14 |
Pages of publication | 7065 - 7072 |
a | 13.503 ± 0.003 Å |
b | 17.504 ± 0.004 Å |
c | 20.41 ± 0.005 Å |
α | 90° |
β | 92.385 ± 0.005° |
γ | 90° |
Cell volume | 4819.9 ± 1.9 Å3 |
Cell temperature | 100 ± 2 K |
Ambient diffraction temperature | 100 ± 2 K |
Number of distinct elements | 5 |
Space group number | 14 |
Hermann-Mauguin space group symbol | P 1 21/n 1 |
Hall space group symbol | -P 2yn |
Residual factor for all reflections | 0.122 |
Residual factor for significantly intense reflections | 0.0882 |
Weighted residual factors for significantly intense reflections | 0.189 |
Weighted residual factors for all reflections included in the refinement | 0.2057 |
Goodness-of-fit parameter for all reflections included in the refinement | 1.035 |
Diffraction radiation wavelength | 0.71073 Å |
Diffraction radiation type | MoKα |