Information card for entry 4343527
Formula | C32 H80 Eu O4 Si8 |
Calculated formula | C32 H80 Eu O4 Si8 |
SMILES | [Eu]1([Si]([Si]([Si]([Si]1([Si](C)(C)C)[Si](C)(C)C)(C)C)(C)C)([Si](C)(C)C)[Si](C)(C)C)([O]1CCCC1)([O]1CCCC1)([O]1CCCC1)[O]1CCCC1 |
Title of publication | Neutral "Cp-Free" Silyl-Lanthanide(II) Complexes: Synthesis, Structure, and Bonding Analysis. |
Authors of publication | Zitz, Rainer; Hlina, Johann; Gatterer, Karl; Marschner, Christoph; Szilvási, Tibor; Baumgartner, Judith |
Journal of publication | Inorganic chemistry |
Year of publication | 2015 |
Journal volume | 54 |
Journal issue | 14 |
Pages of publication | 7065 - 7072 |
a | 49.969 ± 0.009 Å |
b | 49.969 ± 0.009 Å |
c | 11.895 ± 0.003 Å |
α | 90° |
β | 90° |
γ | 120° |
Cell volume | 25722 ± 9 Å3 |
Cell temperature | 100 ± 2 K |
Ambient diffraction temperature | 100 ± 2 K |
Number of distinct elements | 5 |
Space group number | 148 |
Hermann-Mauguin space group symbol | R -3 :H |
Hall space group symbol | -R 3 |
Residual factor for all reflections | 0.0942 |
Residual factor for significantly intense reflections | 0.0678 |
Weighted residual factors for significantly intense reflections | 0.1571 |
Weighted residual factors for all reflections included in the refinement | 0.1701 |
Goodness-of-fit parameter for all reflections included in the refinement | 1.007 |
Diffraction radiation wavelength | 0.71073 Å |
Diffraction radiation type | MoKα |