Information card for entry 4343530
Formula | C30 H78 Eu O3 Si8 |
Calculated formula | C30 H78 Eu O3 Si8 |
SMILES | [Eu]([Si]([Si](C)(C)C)([Si](C)(C)C)[Si](C)(C)C)([Si]([Si](C)(C)C)([Si](C)(C)C)[Si](C)(C)C)([O]1CCCC1)([O]1CCCC1)[O]1CCCC1 |
Title of publication | Neutral "Cp-Free" Silyl-Lanthanide(II) Complexes: Synthesis, Structure, and Bonding Analysis. |
Authors of publication | Zitz, Rainer; Hlina, Johann; Gatterer, Karl; Marschner, Christoph; Szilvási, Tibor; Baumgartner, Judith |
Journal of publication | Inorganic chemistry |
Year of publication | 2015 |
Journal volume | 54 |
Journal issue | 14 |
Pages of publication | 7065 - 7072 |
a | 18.784 ± 0.006 Å |
b | 15.153 ± 0.005 Å |
c | 17.125 ± 0.006 Å |
α | 90° |
β | 90° |
γ | 90° |
Cell volume | 4874 ± 3 Å3 |
Cell temperature | 100 ± 2 K |
Ambient diffraction temperature | 100 ± 2 K |
Number of distinct elements | 5 |
Space group number | 33 |
Hermann-Mauguin space group symbol | P n a 21 |
Hall space group symbol | P 2c -2n |
Residual factor for all reflections | 0.0332 |
Residual factor for significantly intense reflections | 0.0322 |
Weighted residual factors for significantly intense reflections | 0.08 |
Weighted residual factors for all reflections included in the refinement | 0.0807 |
Goodness-of-fit parameter for all reflections included in the refinement | 1.039 |
Diffraction radiation wavelength | 0.71073 Å |
Diffraction radiation type | MoKα |