Information card for entry 4343531
Formula | C30 H78 O3 Si8 Sm |
Calculated formula | C30 H78 O3 Si8 Sm |
SMILES | [O]1(CCCC1)[Sm]([O]1CCCC1)([O]1CCCC1)([Si]([Si](C)(C)C)([Si](C)(C)C)[Si](C)(C)C)[Si]([Si](C)(C)C)([Si](C)(C)C)[Si](C)(C)C |
Title of publication | Neutral "Cp-Free" Silyl-Lanthanide(II) Complexes: Synthesis, Structure, and Bonding Analysis. |
Authors of publication | Zitz, Rainer; Hlina, Johann; Gatterer, Karl; Marschner, Christoph; Szilvási, Tibor; Baumgartner, Judith |
Journal of publication | Inorganic chemistry |
Year of publication | 2015 |
Journal volume | 54 |
Journal issue | 14 |
Pages of publication | 7065 - 7072 |
a | 16.151 ± 0.003 Å |
b | 16.497 ± 0.003 Å |
c | 19.4 ± 0.004 Å |
α | 90° |
β | 90° |
γ | 90° |
Cell volume | 5169 ± 1.7 Å3 |
Cell temperature | 100 ± 2 K |
Ambient diffraction temperature | 100 ± 2 K |
Number of distinct elements | 5 |
Space group number | 60 |
Hermann-Mauguin space group symbol | P b c n |
Hall space group symbol | -P 2n 2ab |
Residual factor for all reflections | 0.0537 |
Residual factor for significantly intense reflections | 0.0352 |
Weighted residual factors for significantly intense reflections | 0.0768 |
Weighted residual factors for all reflections included in the refinement | 0.0822 |
Goodness-of-fit parameter for all reflections included in the refinement | 0.992 |
Diffraction radiation wavelength | 0.71073 Å |
Diffraction radiation type | MoKα |