Information card for entry 4343576
Formula | C12 H20 Cl2 F3 N2 O3 S Sb |
Calculated formula | C12 H20 Cl2 F3 N2 O3 S Sb |
SMILES | c1(n(c(c(C)[n+]1C(C)C)C)C(C)C)[Sb](Cl)Cl.C(F)(F)(F)S(=O)(=O)[O-] |
Title of publication | Synthesis of Selected Cationic Pnictanes [LnPnX3-n](n+) (L = Imidazolium-2-yl; Pn = P, As; n = 1-3) and Replacement Reactions with Pseudohalogens. |
Authors of publication | Henne, F. D.; Dickschat, A. T.; Hennersdorf, F.; Feldmann, K.-O.; Weigand, J. J. |
Journal of publication | Inorganic chemistry |
Year of publication | 2015 |
Journal volume | 54 |
Journal issue | 14 |
Pages of publication | 6849 - 6861 |
a | 10.169 ± 0.0004 Å |
b | 11.0255 ± 0.0004 Å |
c | 17.282 ± 0.0006 Å |
α | 90° |
β | 90° |
γ | 90° |
Cell volume | 1937.63 ± 0.12 Å3 |
Cell temperature | 153 ± 2 K |
Ambient diffraction temperature | 153 ± 1 K |
Number of distinct elements | 8 |
Space group number | 19 |
Hermann-Mauguin space group symbol | P 21 21 21 |
Hall space group symbol | P 2ac 2ab |
Residual factor for all reflections | 0.0255 |
Residual factor for significantly intense reflections | 0.0237 |
Weighted residual factors for significantly intense reflections | 0.0537 |
Weighted residual factors for all reflections included in the refinement | 0.0545 |
Goodness-of-fit parameter for all reflections included in the refinement | 1.021 |
Diffraction radiation wavelength | 0.71073 Å |
Diffraction radiation type | MoKα |