Information card for entry 4343577
Formula | C28 H34 Cl4 F3 N2 O3 P S |
Calculated formula | C28 H34 Cl4 F3 N2 O3 P S |
Title of publication | Synthesis of Selected Cationic Pnictanes [LnPnX3-n](n+) (L = Imidazolium-2-yl; Pn = P, As; n = 1-3) and Replacement Reactions with Pseudohalogens. |
Authors of publication | Henne, F. D.; Dickschat, A. T.; Hennersdorf, F.; Feldmann, K.-O.; Weigand, J. J. |
Journal of publication | Inorganic chemistry |
Year of publication | 2015 |
Journal volume | 54 |
Journal issue | 14 |
Pages of publication | 6849 - 6861 |
a | 12.1467 ± 0.0004 Å |
b | 19.237 ± 0.0005 Å |
c | 14.2131 ± 0.0004 Å |
α | 90° |
β | 97.84 ± 0.002° |
γ | 90° |
Cell volume | 3290.08 ± 0.17 Å3 |
Cell temperature | 153 K |
Ambient diffraction temperature | 153 K |
Number of distinct elements | 8 |
Space group number | 14 |
Hermann-Mauguin space group symbol | P 1 21/n 1 |
Hall space group symbol | -P 2yn |
Residual factor for all reflections | 0.0746 |
Residual factor for significantly intense reflections | 0.0642 |
Weighted residual factors for significantly intense reflections | 0.1834 |
Weighted residual factors for all reflections included in the refinement | 0.1965 |
Goodness-of-fit parameter for all reflections included in the refinement | 1.05 |
Diffraction radiation wavelength | 1.54178 Å |
Diffraction radiation type | CuKα |