Information card for entry 4343967
Formula | C40 H37 F3 N4 O3 P2 S |
Calculated formula | C40 H37 F3 N4 O3 P2 S |
Title of publication | Structures, Electronics, and Reactivity of Strained Phosphazane Cages: A Combined Experimental and Computational Study. |
Authors of publication | Roth, Torsten; Vasilenko, Vladislav; Wadepohl, Hubert; Wright, Dominic S.; Gade, Lutz H. |
Journal of publication | Inorganic chemistry |
Year of publication | 2015 |
Journal volume | 54 |
Journal issue | 15 |
Pages of publication | 7636 - 7644 |
a | 10.467 ± 0.006 Å |
b | 17.866 ± 0.01 Å |
c | 19.99 ± 0.012 Å |
α | 90° |
β | 90° |
γ | 90° |
Cell volume | 3738 ± 4 Å3 |
Cell temperature | 100 ± 2 K |
Ambient diffraction temperature | 100 ± 1 K |
Number of distinct elements | 7 |
Space group number | 19 |
Hermann-Mauguin space group symbol | P 21 21 21 |
Hall space group symbol | P 2ac 2ab |
Residual factor for all reflections | 0.0528 |
Residual factor for significantly intense reflections | 0.0412 |
Weighted residual factors for significantly intense reflections | 0.097 |
Weighted residual factors for all reflections included in the refinement | 0.1044 |
Goodness-of-fit parameter for all reflections included in the refinement | 1.046 |
Diffraction radiation probe | x-ray |
Diffraction radiation wavelength | 0.71073 Å |
Diffraction radiation type | MoKα |