Information card for entry 4343968
Formula | C52 H75 Cl4 F3 Ir2 N4 O3 P2 S |
Calculated formula | C52 H75 Cl4 F3 Ir2 N4 O3 P2 S |
Title of publication | Structures, Electronics, and Reactivity of Strained Phosphazane Cages: A Combined Experimental and Computational Study. |
Authors of publication | Roth, Torsten; Vasilenko, Vladislav; Wadepohl, Hubert; Wright, Dominic S.; Gade, Lutz H. |
Journal of publication | Inorganic chemistry |
Year of publication | 2015 |
Journal volume | 54 |
Journal issue | 15 |
Pages of publication | 7636 - 7644 |
a | 10.61 ± 0.005 Å |
b | 15.089 ± 0.007 Å |
c | 17.314 ± 0.008 Å |
α | 98.124 ± 0.012° |
β | 92.831 ± 0.013° |
γ | 91.799 ± 0.013° |
Cell volume | 2739 ± 2 Å3 |
Cell temperature | 100 ± 2 K |
Ambient diffraction temperature | 100 ± 1 K |
Number of distinct elements | 9 |
Space group number | 2 |
Hermann-Mauguin space group symbol | P -1 |
Hall space group symbol | -P 1 |
Residual factor for all reflections | 0.0633 |
Residual factor for significantly intense reflections | 0.0483 |
Weighted residual factors for significantly intense reflections | 0.1179 |
Weighted residual factors for all reflections included in the refinement | 0.1256 |
Goodness-of-fit parameter for all reflections included in the refinement | 1.041 |
Diffraction radiation probe | x-ray |
Diffraction radiation wavelength | 0.71073 Å |
Diffraction radiation type | MoKα |