Information card for entry 4343979
Formula | C36 H38 Ge Mo10 N10 Ni2 O40 |
Calculated formula | C36 H30 Ge Mo10 N10 Ni2 O40 |
Title of publication | Two Compounds Constructed from Bimolybdenum-Capped Sandwich-Type Tetra-Ni-molybdogermanate and N-Donor Multidentate Ligand. |
Authors of publication | Zhou, Shi; Liu, Bo; Shi, Tian; Li, Xiao-Min; Chen, Ya-Guang |
Journal of publication | Inorganic chemistry |
Year of publication | 2015 |
Journal volume | 54 |
Journal issue | 15 |
Pages of publication | 7165 - 7170 |
a | 13.2203 ± 0.0006 Å |
b | 15.6458 ± 0.0007 Å |
c | 16.3157 ± 0.0008 Å |
α | 70.832 ± 0.001° |
β | 69.592 ± 0.001° |
γ | 74.824 ± 0.001° |
Cell volume | 2946 ± 0.2 Å3 |
Cell temperature | 293 ± 2 K |
Ambient diffraction temperature | 293 ± 2 K |
Number of distinct elements | 7 |
Space group number | 2 |
Hermann-Mauguin space group symbol | P -1 |
Hall space group symbol | -P 1 |
Residual factor for all reflections | 0.0635 |
Residual factor for significantly intense reflections | 0.0405 |
Weighted residual factors for significantly intense reflections | 0.0954 |
Weighted residual factors for all reflections included in the refinement | 0.1071 |
Goodness-of-fit parameter for all reflections included in the refinement | 1.008 |
Diffraction radiation wavelength | 0.71073 Å |
Diffraction radiation type | MoKα |