Information card for entry 4343980
Formula | C36 H44 Ge Mo10 N10 Ni3 O44 |
Calculated formula | C36 H29 Ge Mo10 N10 Ni3 O43.99 |
Title of publication | Two Compounds Constructed from Bimolybdenum-Capped Sandwich-Type Tetra-Ni-molybdogermanate and N-Donor Multidentate Ligand. |
Authors of publication | Zhou, Shi; Liu, Bo; Shi, Tian; Li, Xiao-Min; Chen, Ya-Guang |
Journal of publication | Inorganic chemistry |
Year of publication | 2015 |
Journal volume | 54 |
Journal issue | 15 |
Pages of publication | 7165 - 7170 |
a | 13.105 ± 0.005 Å |
b | 15.255 ± 0.005 Å |
c | 19.002 ± 0.005 Å |
α | 71.97 ± 0.005° |
β | 74.56 ± 0.005° |
γ | 79.579 ± 0.005° |
Cell volume | 3462 ± 2 Å3 |
Cell temperature | 293 ± 2 K |
Ambient diffraction temperature | 293 ± 2 K |
Number of distinct elements | 7 |
Space group number | 2 |
Hermann-Mauguin space group symbol | P -1 |
Hall space group symbol | -P 1 |
Residual factor for all reflections | 0.0452 |
Residual factor for significantly intense reflections | 0.0373 |
Weighted residual factors for significantly intense reflections | 0.1084 |
Weighted residual factors for all reflections included in the refinement | 0.1151 |
Goodness-of-fit parameter for all reflections included in the refinement | 1.025 |
Diffraction radiation wavelength | 0.71073 Å |
Diffraction radiation type | MoKα |