Information card for entry 4343981
Formula | C32 H50.16 Cl2 N6 O14.58 V2 |
Calculated formula | C32 H30 Cl2 N6 O14.586 V2 |
Title of publication | Aerial Oxidation of a V(IV)-Iminopyridine Hydroquinonate Complex: A Trap for the V(IV)-Semiquinonate Radical Intermediate. |
Authors of publication | Stylianou, Marios; Drouza, Chryssoula; Giapintzakis, John; Athanasopoulos, Georgios I.; Keramidas, Anastasios D. |
Journal of publication | Inorganic chemistry |
Year of publication | 2015 |
Journal volume | 54 |
Journal issue | 15 |
Pages of publication | 7218 - 7229 |
a | 24.9994 ± 0.0005 Å |
b | 24.9994 ± 0.0005 Å |
c | 17.3225 ± 0.0004 Å |
α | 90° |
β | 90° |
γ | 120° |
Cell volume | 9375.6 ± 0.3 Å3 |
Cell temperature | 100 ± 2 K |
Ambient diffraction temperature | 100 ± 2 K |
Number of distinct elements | 6 |
Space group number | 148 |
Hermann-Mauguin space group symbol | R -3 :H |
Hall space group symbol | -R 3 |
Residual factor for all reflections | 0.1286 |
Residual factor for significantly intense reflections | 0.0641 |
Weighted residual factors for significantly intense reflections | 0.1731 |
Weighted residual factors for all reflections included in the refinement | 0.1935 |
Goodness-of-fit parameter for all reflections included in the refinement | 0.928 |
Diffraction radiation wavelength | 0.71073 Å |
Diffraction radiation type | MoKα |