Information card for entry 4343987
Formula | C36 H36 Cl2 N8 O4 V2 |
Calculated formula | C36 H30 Cl2 N8 O4 V2 |
SMILES | c12c(C[N]34Cc5[n]([V]3([n]3c(C4)cccc3)(O1)(=O)Cl)cccc5)cc1c(c2)C[N]23Cc4cccc[n]4[V]2([n]2c(C3)cccc2)(O1)(=O)Cl.N#CC.N#CC |
Title of publication | Aerial Oxidation of a V(IV)-Iminopyridine Hydroquinonate Complex: A Trap for the V(IV)-Semiquinonate Radical Intermediate. |
Authors of publication | Stylianou, Marios; Drouza, Chryssoula; Giapintzakis, John; Athanasopoulos, Georgios I.; Keramidas, Anastasios D. |
Journal of publication | Inorganic chemistry |
Year of publication | 2015 |
Journal volume | 54 |
Journal issue | 15 |
Pages of publication | 7218 - 7229 |
a | 6.6738 ± 0.0002 Å |
b | 15.1821 ± 0.0005 Å |
c | 18.6301 ± 0.0007 Å |
α | 90° |
β | 95.239 ± 0.004° |
γ | 90° |
Cell volume | 1879.76 ± 0.11 Å3 |
Cell temperature | 100 K |
Ambient diffraction temperature | 100 K |
Number of distinct elements | 6 |
Space group number | 14 |
Hermann-Mauguin space group symbol | P 1 21/c 1 |
Hall space group symbol | -P 2ybc |
Residual factor for all reflections | 0.1565 |
Residual factor for significantly intense reflections | 0.0626 |
Weighted residual factors for significantly intense reflections | 0.1246 |
Weighted residual factors for all reflections included in the refinement | 0.1458 |
Goodness-of-fit parameter for all reflections included in the refinement | 0.833 |
Diffraction radiation wavelength | 0.71073 Å |
Diffraction radiation type | MoKα |