Information card for entry 4343995
Formula | C36 H26 Cu12 N28 Na O147 P5 W30 |
Calculated formula | C36 H26 Cu12 N28 Na O147 P5 W30 |
Title of publication | Four Hybrid Materials Based on Preyssler P5W30 Polyoxometalate and First-Row Transition-Metal Complex. |
Authors of publication | Hu, Tuo-Ping; Zhao, Ya-Qin; Jagličić, Zvonko; Yu, Kai; Wang, Xing-Po; Sun, Di |
Journal of publication | Inorganic chemistry |
Year of publication | 2015 |
Journal volume | 54 |
Journal issue | 15 |
Pages of publication | 7415 - 7423 |
a | 29.3948 ± 0.0019 Å |
b | 21.2938 ± 0.0014 Å |
c | 28.618 ± 0.0019 Å |
α | 90° |
β | 110.722 ± 0.001° |
γ | 90° |
Cell volume | 16754 ± 1.9 Å3 |
Cell temperature | 298 ± 2 K |
Ambient diffraction temperature | 298 ± 2 K |
Number of distinct elements | 8 |
Space group number | 15 |
Hermann-Mauguin space group symbol | C 1 2/c 1 |
Hall space group symbol | -C 2yc |
Residual factor for all reflections | 0.0563 |
Residual factor for significantly intense reflections | 0.0466 |
Weighted residual factors for significantly intense reflections | 0.1203 |
Weighted residual factors for all reflections included in the refinement | 0.1277 |
Goodness-of-fit parameter for all reflections included in the refinement | 1.027 |
Diffraction radiation wavelength | 0.71073 Å |
Diffraction radiation type | MoKα |