Information card for entry 4343996
Formula | C54 H46 Cu10 K N42 O125 P5 W30 |
Calculated formula | C54 H46 Cu10 K N42 O125 P5 W30 |
Title of publication | Four Hybrid Materials Based on Preyssler P5W30 Polyoxometalate and First-Row Transition-Metal Complex. |
Authors of publication | Hu, Tuo-Ping; Zhao, Ya-Qin; Jagličić, Zvonko; Yu, Kai; Wang, Xing-Po; Sun, Di |
Journal of publication | Inorganic chemistry |
Year of publication | 2015 |
Journal volume | 54 |
Journal issue | 15 |
Pages of publication | 7415 - 7423 |
a | 21.5819 ± 0.0017 Å |
b | 19.2279 ± 0.0016 Å |
c | 25.74 ± 0.002 Å |
α | 90° |
β | 95.2863 ± 0.0015° |
γ | 90° |
Cell volume | 10636 ± 1.5 Å3 |
Cell temperature | 298 ± 2 K |
Ambient diffraction temperature | 298 ± 2 K |
Number of distinct elements | 8 |
Space group number | 14 |
Hermann-Mauguin space group symbol | P 1 21/n 1 |
Hall space group symbol | -P 2yn |
Residual factor for all reflections | 0.1197 |
Residual factor for significantly intense reflections | 0.0997 |
Weighted residual factors for significantly intense reflections | 0.2673 |
Weighted residual factors for all reflections included in the refinement | 0.2796 |
Goodness-of-fit parameter for all reflections included in the refinement | 1.054 |
Diffraction radiation wavelength | 0.71073 Å |
Diffraction radiation type | MoKα |