Information card for entry 4343997
Formula | C60 H84 N24 Na Ni6 O127 P5 W30 |
Calculated formula | C60 H84 N24 Na Ni6 O127 P5 W30 |
Title of publication | Four Hybrid Materials Based on Preyssler P5W30 Polyoxometalate and First-Row Transition-Metal Complex. |
Authors of publication | Hu, Tuo-Ping; Zhao, Ya-Qin; Jagličić, Zvonko; Yu, Kai; Wang, Xing-Po; Sun, Di |
Journal of publication | Inorganic chemistry |
Year of publication | 2015 |
Journal volume | 54 |
Journal issue | 15 |
Pages of publication | 7415 - 7423 |
a | 25.457 ± 0.0015 Å |
b | 21.8687 ± 0.0013 Å |
c | 34.667 ± 0.002 Å |
α | 90° |
β | 108.143 ± 0.001° |
γ | 90° |
Cell volume | 18340 ± 1.9 Å3 |
Cell temperature | 298 ± 2 K |
Ambient diffraction temperature | 298 ± 2 K |
Number of distinct elements | 8 |
Space group number | 15 |
Hermann-Mauguin space group symbol | C 1 2/c 1 |
Hall space group symbol | -C 2yc |
Residual factor for all reflections | 0.0859 |
Residual factor for significantly intense reflections | 0.0592 |
Weighted residual factors for significantly intense reflections | 0.1424 |
Weighted residual factors for all reflections included in the refinement | 0.1518 |
Goodness-of-fit parameter for all reflections included in the refinement | 0.889 |
Diffraction radiation wavelength | 0.71073 Å |
Diffraction radiation type | MoKα |