Information card for entry 4344008
Formula | B7 Cs2 Li5 O14 |
Calculated formula | B7 Cs2 Li5 O14 |
Title of publication | Two New Crystals in LimCsnBm+nO2(m+n) (m + n = 5, 7; m > n) Series: Noncentrosymmetric Li5Cs2B7O14 and Centrosymmetric Li4CsB5O10. |
Authors of publication | Li, Lin; Han, Shujuan; Lei, Binghua; Dong, Xiaoyu; Wu, Hongping; Zhou, Zhongxiang; Yang, Zhihua; Pan, Shilie |
Journal of publication | Inorganic chemistry |
Year of publication | 2015 |
Journal volume | 54 |
Journal issue | 15 |
Pages of publication | 7381 - 7387 |
a | 21.2775 ± 0.0017 Å |
b | 13.6296 ± 0.0011 Å |
c | 4.4283 ± 0.0004 Å |
α | 90° |
β | 90° |
γ | 90° |
Cell volume | 1284.22 ± 0.19 Å3 |
Cell temperature | 296 ± 2 K |
Ambient diffraction temperature | 296 ± 2 K |
Number of distinct elements | 4 |
Space group number | 40 |
Hermann-Mauguin space group symbol | A m a 2 |
Hall space group symbol | A 2 -2a |
Residual factor for all reflections | 0.0219 |
Residual factor for significantly intense reflections | 0.0192 |
Weighted residual factors for significantly intense reflections | 0.0429 |
Weighted residual factors for all reflections included in the refinement | 0.0443 |
Goodness-of-fit parameter for all reflections included in the refinement | 1.042 |
Diffraction radiation wavelength | 0.71073 Å |
Diffraction radiation type | MoKα |