Information card for entry 4344009
Formula | B5 Cs Li4 O10 |
Calculated formula | B5 Cs Li4 O10 |
Title of publication | Two New Crystals in LimCsnBm+nO2(m+n) (m + n = 5, 7; m > n) Series: Noncentrosymmetric Li5Cs2B7O14 and Centrosymmetric Li4CsB5O10. |
Authors of publication | Li, Lin; Han, Shujuan; Lei, Binghua; Dong, Xiaoyu; Wu, Hongping; Zhou, Zhongxiang; Yang, Zhihua; Pan, Shilie |
Journal of publication | Inorganic chemistry |
Year of publication | 2015 |
Journal volume | 54 |
Journal issue | 15 |
Pages of publication | 7381 - 7387 |
a | 6.894 ± 0.005 Å |
b | 9.369 ± 0.006 Å |
c | 16.004 ± 0.011 Å |
α | 90° |
β | 98.271 ± 0.009° |
γ | 90° |
Cell volume | 1022.9 ± 1.2 Å3 |
Cell temperature | 296 ± 2 K |
Ambient diffraction temperature | 296 ± 2 K |
Number of distinct elements | 4 |
Space group number | 14 |
Hermann-Mauguin space group symbol | P 1 21/c 1 |
Hall space group symbol | -P 2ybc |
Residual factor for all reflections | 0.0621 |
Residual factor for significantly intense reflections | 0.0412 |
Weighted residual factors for significantly intense reflections | 0.0879 |
Weighted residual factors for all reflections included in the refinement | 0.0979 |
Goodness-of-fit parameter for all reflections included in the refinement | 1.043 |
Diffraction radiation wavelength | 0.71073 Å |
Diffraction radiation type | MoKα |