Information card for entry 4344016
Formula | C16 H18 Cl2 N2 O Zn |
Calculated formula | C16 H18 Cl2 N2 O Zn |
SMILES | [Zn]1(Cl)(Cl)[n]2c(cccc2OC)C=[N]1c1c(cc(cc1C)C)C |
Title of publication | Tunable Luminescence and Application in Dye-Sensitized Solar Cells of Zn(II)/Hg(II) Complexes: Methyl Substitution-Induced Supramolecular Structures Based on (E)-N-(6-Methoxypyridin-2-ylmethylene)arylamine Derivatives. |
Authors of publication | Dong, Yu-Wei; Fan, Rui-Qing; Wang, Ping; Wei, Li-Guo; Wang, Xin-Ming; Gao, Song; Zhang, Hui-Jie; Yang, Yu-Lin; Wang, Yu-Lei |
Journal of publication | Inorganic chemistry |
Year of publication | 2015 |
Journal volume | 54 |
Journal issue | 16 |
Pages of publication | 7742 - 7752 |
a | 7.896 ± 0.0016 Å |
b | 8.027 ± 0.0016 Å |
c | 15.009 ± 0.003 Å |
α | 82.46 ± 0.03° |
β | 82.35 ± 0.03° |
γ | 72.42 ± 0.03° |
Cell volume | 894.6 ± 0.3 Å3 |
Cell temperature | 293 ± 2 K |
Ambient diffraction temperature | 293 ± 2 K |
Number of distinct elements | 6 |
Space group number | 2 |
Hermann-Mauguin space group symbol | P -1 |
Hall space group symbol | -P 1 |
Residual factor for all reflections | 0.0866 |
Residual factor for significantly intense reflections | 0.0535 |
Weighted residual factors for significantly intense reflections | 0.1456 |
Weighted residual factors for all reflections included in the refinement | 0.1743 |
Goodness-of-fit parameter for all reflections included in the refinement | 1.007 |
Diffraction radiation wavelength | 0.71073 Å |
Diffraction radiation type | MoKα |