Information card for entry 4344017
Formula | C16 H18 Cl2 Hg N2 O |
Calculated formula | C16 H18 Cl2 Hg N2 O |
SMILES | [Hg]1(Cl)(Cl)[n]2c(cccc2OC)C=[N]1c1c(cc(cc1C)C)C |
Title of publication | Tunable Luminescence and Application in Dye-Sensitized Solar Cells of Zn(II)/Hg(II) Complexes: Methyl Substitution-Induced Supramolecular Structures Based on (E)-N-(6-Methoxypyridin-2-ylmethylene)arylamine Derivatives. |
Authors of publication | Dong, Yu-Wei; Fan, Rui-Qing; Wang, Ping; Wei, Li-Guo; Wang, Xin-Ming; Gao, Song; Zhang, Hui-Jie; Yang, Yu-Lin; Wang, Yu-Lei |
Journal of publication | Inorganic chemistry |
Year of publication | 2015 |
Journal volume | 54 |
Journal issue | 16 |
Pages of publication | 7742 - 7752 |
a | 15.246 ± 0.003 Å |
b | 7.5877 ± 0.0015 Å |
c | 16.816 ± 0.003 Å |
α | 90° |
β | 111.32 ± 0.03° |
γ | 90° |
Cell volume | 1812.2 ± 0.7 Å3 |
Cell temperature | 293 ± 2 K |
Ambient diffraction temperature | 293 ± 2 K |
Number of distinct elements | 6 |
Space group number | 7 |
Hermann-Mauguin space group symbol | P 1 c 1 |
Hall space group symbol | P -2yc |
Residual factor for all reflections | 0.0301 |
Residual factor for significantly intense reflections | 0.0284 |
Weighted residual factors for significantly intense reflections | 0.0608 |
Weighted residual factors for all reflections included in the refinement | 0.0619 |
Goodness-of-fit parameter for all reflections included in the refinement | 1.005 |
Diffraction radiation wavelength | 0.71073 Å |
Diffraction radiation type | MoKα |