Information card for entry 4344097
Formula | C24 H40 Ge0 N0 O Sr |
Calculated formula | C24 H40 O Sr |
Title of publication | Alkaline-Earth-Metal-Induced Liberation of Rare Allotropes of Elemental Silicon and Germanium from N-Heterocyclic Metallylenes. |
Authors of publication | Blom, Burgert; Said, Amro; Szilvási, Tibor; Menezes, Prashanth W.; Tan, Gengwen; Baumgartner, Judith; Driess, Matthias |
Journal of publication | Inorganic chemistry |
Year of publication | 2015 |
Journal volume | 54 |
Journal issue | 17 |
Pages of publication | 8840 - 8848 |
a | 8.4985 ± 0.0001 Å |
b | 15.2084 ± 0.0001 Å |
c | 18.599 ± 0.0002 Å |
α | 90° |
β | 90° |
γ | 90° |
Cell volume | 2403.89 ± 0.04 Å3 |
Cell temperature | 150 ± 2 K |
Ambient diffraction temperature | 150 ± 2 K |
Number of distinct elements | 6 |
Space group number | 19 |
Hermann-Mauguin space group symbol | P 21 21 21 |
Hall space group symbol | P 2ac 2ab |
Residual factor for all reflections | 0.0217 |
Residual factor for significantly intense reflections | 0.0208 |
Weighted residual factors for significantly intense reflections | 0.0561 |
Weighted residual factors for all reflections included in the refinement | 0.0568 |
Goodness-of-fit parameter for all reflections included in the refinement | 1.032 |
Diffraction radiation wavelength | 1.54178 Å |
Diffraction radiation type | CuKα |