Information card for entry 4344098
Formula | C44 H66 Ge0 N2 O0 Sr |
Calculated formula | C44 H66 N2 Sr |
SMILES | [Sr]123456789([N](=CC=[N]1C(C)(C)C)C(C)(C)C)([c]1([c]5([c]4([c]3([c]21C)C)C)C)C)[c]1([c]6([c]7([c]8([c]91C)C)C)C)C.c1(ccccc1)C.c1(ccccc1)C |
Title of publication | Alkaline-Earth-Metal-Induced Liberation of Rare Allotropes of Elemental Silicon and Germanium from N-Heterocyclic Metallylenes. |
Authors of publication | Blom, Burgert; Said, Amro; Szilvási, Tibor; Menezes, Prashanth W.; Tan, Gengwen; Baumgartner, Judith; Driess, Matthias |
Journal of publication | Inorganic chemistry |
Year of publication | 2015 |
Journal volume | 54 |
Journal issue | 17 |
Pages of publication | 8840 - 8848 |
a | 15.4379 ± 0.0003 Å |
b | 17.3811 ± 0.0003 Å |
c | 16.8583 ± 0.0003 Å |
α | 90° |
β | 113.311 ± 0.002° |
γ | 90° |
Cell volume | 4154.29 ± 0.15 Å3 |
Cell temperature | 150 ± 2 K |
Ambient diffraction temperature | 150 ± 2 K |
Number of distinct elements | 6 |
Space group number | 14 |
Hermann-Mauguin space group symbol | P 1 21/c 1 |
Hall space group symbol | -P 2ybc |
Residual factor for all reflections | 0.0267 |
Residual factor for significantly intense reflections | 0.0248 |
Weighted residual factors for significantly intense reflections | 0.0685 |
Weighted residual factors for all reflections included in the refinement | 0.07 |
Goodness-of-fit parameter for all reflections included in the refinement | 1.051 |
Diffraction radiation wavelength | 1.54184 Å |
Diffraction radiation type | CuKα |