Information card for entry 4344398
Formula | C50 H87 Co N5 O2 P3 Ti |
Calculated formula | C50 H87 Co N5 O2 P3 Ti |
Title of publication | Heterobimetallic Ti/Co Complexes That Promote Catalytic N-N Bond Cleavage. |
Authors of publication | Wu, Bing; Gramigna, Kathryn M.; Bezpalko, Mark W.; Foxman, Bruce M.; Thomas, Christine M. |
Journal of publication | Inorganic chemistry |
Year of publication | 2015 |
Journal volume | 54 |
Journal issue | 22 |
Pages of publication | 10909 - 10917 |
a | 12.576 ± 0.0003 Å |
b | 19.1361 ± 0.0005 Å |
c | 23.333 ± 0.0005 Å |
α | 104.592 ± 0.0012° |
β | 91.5782 ± 0.0012° |
γ | 93.0024 ± 0.0012° |
Cell volume | 5421.8 ± 0.2 Å3 |
Cell temperature | 120 K |
Ambient diffraction temperature | 120 K |
Number of distinct elements | 7 |
Space group number | 2 |
Hermann-Mauguin space group symbol | P -1 |
Hall space group symbol | -P 1 |
Residual factor for all reflections | 0.0569 |
Residual factor for significantly intense reflections | 0.0373 |
Weighted residual factors for all reflections | 0.0926 |
Weighted residual factors for significantly intense reflections | 0.0837 |
Weighted residual factors for all reflections included in the refinement | 0.0926 |
Goodness-of-fit parameter for all reflections included in the refinement | 1 |
Diffraction radiation wavelength | 0.71073 Å |
Diffraction radiation type | MoKα |