Information card for entry 4344399
Formula | C46 H77 Co N3 O P3 Ti |
Calculated formula | C46 H77 Co N3 O P3 Ti |
Title of publication | Heterobimetallic Ti/Co Complexes That Promote Catalytic N-N Bond Cleavage. |
Authors of publication | Wu, Bing; Gramigna, Kathryn M.; Bezpalko, Mark W.; Foxman, Bruce M.; Thomas, Christine M. |
Journal of publication | Inorganic chemistry |
Year of publication | 2015 |
Journal volume | 54 |
Journal issue | 22 |
Pages of publication | 10909 - 10917 |
a | 10.2861 ± 0.0007 Å |
b | 22.3494 ± 0.0015 Å |
c | 23.014 ± 0.0016 Å |
α | 114.859 ± 0.003° |
β | 95.714 ± 0.004° |
γ | 96.367 ± 0.004° |
Cell volume | 4707.7 ± 0.6 Å3 |
Cell temperature | 120 K |
Ambient diffraction temperature | 120 K |
Number of distinct elements | 7 |
Space group number | 2 |
Hermann-Mauguin space group symbol | P -1 |
Hall space group symbol | -P 1 |
Residual factor for all reflections | 0.0691 |
Residual factor for significantly intense reflections | 0.0382 |
Weighted residual factors for all reflections | 0.0926 |
Weighted residual factors for significantly intense reflections | 0.0803 |
Weighted residual factors for all reflections included in the refinement | 0.0926 |
Goodness-of-fit parameter for all reflections included in the refinement | 1 |
Diffraction radiation wavelength | 0.71073 Å |
Diffraction radiation type | MoKα |