Information card for entry 4346021
Formula | C97 H120 Cl12 N8 O23 Tb4 |
Calculated formula | C97 H120 Cl12 N8 O23 Tb4 |
Title of publication | Single-molecule magnet of a tetranuclear dysprosium complex disturbed by a salen-type ligand and chloride counterions. |
Authors of publication | Luan, Fang; Liu, Tianqi; Yan, Pengfei; Zou, Xiaoyan; Li, Yuxin; Li, Guangming |
Journal of publication | Inorganic chemistry |
Year of publication | 2015 |
Journal volume | 54 |
Journal issue | 7 |
Pages of publication | 3485 - 3490 |
a | 17.8721 ± 0.0004 Å |
b | 16.5942 ± 0.0004 Å |
c | 24.4103 ± 0.0006 Å |
α | 90° |
β | 130.183 ± 0.001° |
γ | 90° |
Cell volume | 5530.8 ± 0.2 Å3 |
Cell temperature | 293 ± 2 K |
Ambient diffraction temperature | 293 ± 2 K |
Number of distinct elements | 6 |
Space group number | 14 |
Hermann-Mauguin space group symbol | P 1 21/c 1 |
Hall space group symbol | -P 2ybc |
Residual factor for all reflections | 0.0716 |
Residual factor for significantly intense reflections | 0.0514 |
Weighted residual factors for significantly intense reflections | 0.1285 |
Weighted residual factors for all reflections included in the refinement | 0.1434 |
Goodness-of-fit parameter for all reflections included in the refinement | 1.041 |
Diffraction radiation wavelength | 0.71073 Å |
Diffraction radiation type | MoKα |