Information card for entry 4346022
Formula | C97 H120 Cl12 Ho4 N8 O23 |
Calculated formula | C97 H120 Cl12 Ho4 N8 O23 |
Title of publication | Single-molecule magnet of a tetranuclear dysprosium complex disturbed by a salen-type ligand and chloride counterions. |
Authors of publication | Luan, Fang; Liu, Tianqi; Yan, Pengfei; Zou, Xiaoyan; Li, Yuxin; Li, Guangming |
Journal of publication | Inorganic chemistry |
Year of publication | 2015 |
Journal volume | 54 |
Journal issue | 7 |
Pages of publication | 3485 - 3490 |
a | 17.8921 ± 0.0005 Å |
b | 16.5528 ± 0.0004 Å |
c | 24.4805 ± 0.0006 Å |
α | 90° |
β | 130.332 ± 0.002° |
γ | 90° |
Cell volume | 5526.9 ± 0.3 Å3 |
Cell temperature | 293 ± 2 K |
Ambient diffraction temperature | 293 ± 2 K |
Number of distinct elements | 6 |
Space group number | 14 |
Hermann-Mauguin space group symbol | P 1 21/c 1 |
Hall space group symbol | -P 2ybc |
Residual factor for all reflections | 0.0785 |
Residual factor for significantly intense reflections | 0.0549 |
Weighted residual factors for significantly intense reflections | 0.1359 |
Weighted residual factors for all reflections included in the refinement | 0.1544 |
Goodness-of-fit parameter for all reflections included in the refinement | 1.048 |
Diffraction radiation wavelength | 0.71073 Å |
Diffraction radiation type | MoKα |