Information card for entry 4346031
Formula | C10 H13 Co N3 O5 |
Calculated formula | C10 H13 Co N3 O5 |
Title of publication | Switching a 2D Co(II) layer to a 3D Co7-cluster-based metal-organic framework: syntheses, crystal structures, and magnetic properties. |
Authors of publication | Chen, Di-Ming; Ma, Xiao-Zhou; Zhang, Xue-Jing; Xu, Na; Cheng, Peng |
Journal of publication | Inorganic chemistry |
Year of publication | 2015 |
Journal volume | 54 |
Journal issue | 6 |
Pages of publication | 2976 - 2982 |
a | 11.4105 ± 0.0009 Å |
b | 6.957 ± 0.0003 Å |
c | 15.5927 ± 0.0009 Å |
α | 90° |
β | 95.977 ± 0.006° |
γ | 90° |
Cell volume | 1231.06 ± 0.13 Å3 |
Cell temperature | 293 ± 2 K |
Ambient diffraction temperature | 293 ± 2 K |
Number of distinct elements | 5 |
Space group number | 14 |
Hermann-Mauguin space group symbol | P 1 21/c 1 |
Hall space group symbol | -P 2ybc |
Residual factor for all reflections | 0.0723 |
Residual factor for significantly intense reflections | 0.0545 |
Weighted residual factors for significantly intense reflections | 0.1308 |
Weighted residual factors for all reflections included in the refinement | 0.1498 |
Goodness-of-fit parameter for all reflections included in the refinement | 1.052 |
Diffraction radiation wavelength | 0.71073 Å |
Diffraction radiation type | MoKα |