Information card for entry 4346032
Formula | C89 H105 Co7 N27 O32 |
Calculated formula | C80 H78 Co7 N24 O26 |
Title of publication | Switching a 2D Co(II) layer to a 3D Co7-cluster-based metal-organic framework: syntheses, crystal structures, and magnetic properties. |
Authors of publication | Chen, Di-Ming; Ma, Xiao-Zhou; Zhang, Xue-Jing; Xu, Na; Cheng, Peng |
Journal of publication | Inorganic chemistry |
Year of publication | 2015 |
Journal volume | 54 |
Journal issue | 6 |
Pages of publication | 2976 - 2982 |
a | 14.443 ± 0.0007 Å |
b | 22.1987 ± 0.0013 Å |
c | 17.7628 ± 0.0012 Å |
α | 90° |
β | 103.975 ± 0.006° |
γ | 90° |
Cell volume | 5526.5 ± 0.6 Å3 |
Cell temperature | 293 ± 2 K |
Ambient diffraction temperature | 293 ± 2 K |
Number of distinct elements | 5 |
Space group number | 14 |
Hermann-Mauguin space group symbol | P 1 21/n 1 |
Hall space group symbol | -P 2yn |
Residual factor for all reflections | 0.0717 |
Residual factor for significantly intense reflections | 0.0587 |
Weighted residual factors for significantly intense reflections | 0.1728 |
Weighted residual factors for all reflections included in the refinement | 0.1818 |
Goodness-of-fit parameter for all reflections included in the refinement | 1.08 |
Diffraction radiation wavelength | 0.71073 Å |
Diffraction radiation type | MoKα |