Information card for entry 4346033
Formula | C40 H22 O16 Re4 Sb2 |
Calculated formula | C40 H22 O16 Re4 Sb2 |
SMILES | C(#[O])[Re]1(C#[O])(C#[O])(C#[O])[Sb](c2ccccc2)(c2ccccc2)[Re](C#[O])(C#[O])(C#[O])(C#[O])[H][Re](C#[O])(C#[O])([Sb](c2ccccc2)(c2ccccc2)[Re]([H]1)(C#[O])(C#[O])(C#[O])C#[O])(C#[O])C#[O] |
Title of publication | Host-guest behavior of a heavy-atom heterocycle Re4(CO)16(μ-SbPh2)2(μ-H)2 obtained from a palladium-assisted ring opening dimerization of Re2(CO)8(μ-SbPh2)(μ-H). |
Authors of publication | Adams, Richard D.; Pearl, Jr, William C; Wong, Yuen Onn; Hall, Michael B.; Walensky, Justin R. |
Journal of publication | Inorganic chemistry |
Year of publication | 2015 |
Journal volume | 54 |
Journal issue | 7 |
Pages of publication | 3536 - 3544 |
a | 19.9667 ± 0.0018 Å |
b | 13.528 ± 0.0012 Å |
c | 19.2161 ± 0.0017 Å |
α | 90° |
β | 118.476 ± 0.002° |
γ | 90° |
Cell volume | 4562.5 ± 0.7 Å3 |
Cell temperature | 294 ± 2 K |
Ambient diffraction temperature | 294 ± 2 K |
Number of distinct elements | 5 |
Space group number | 15 |
Hermann-Mauguin space group symbol | C 1 2/c 1 |
Hall space group symbol | -C 2yc |
Residual factor for all reflections | 0.034 |
Residual factor for significantly intense reflections | 0.0247 |
Weighted residual factors for significantly intense reflections | 0.0465 |
Weighted residual factors for all reflections included in the refinement | 0.0493 |
Goodness-of-fit parameter for all reflections included in the refinement | 1.044 |
Diffraction radiation wavelength | 0.71073 Å |
Diffraction radiation type | MoKα |