Information card for entry 4346082
Formula | C25 H24 Br Cl N4 O3 Pt |
Calculated formula | C25 H24 Br Cl N4 O3 Pt |
Title of publication | Bifunctional reactivity of amidoximes observed upon nucleophilic addition to metal-activated nitriles. |
Authors of publication | Bolotin, Dmitrii S.; Demakova, Marina Ya; Novikov, Alexander S.; Avdontceva, Margarita S.; Kuznetsov, Maxim L.; Bokach, Nadezhda A.; Kukushkin, Vadim Yu |
Journal of publication | Inorganic chemistry |
Year of publication | 2015 |
Journal volume | 54 |
Journal issue | 8 |
Pages of publication | 4039 - 4046 |
a | 10.2034 ± 0.0005 Å |
b | 11.2453 ± 0.0006 Å |
c | 12.0939 ± 0.0006 Å |
α | 102.552 ± 0.004° |
β | 105.682 ± 0.004° |
γ | 102.043 ± 0.004° |
Cell volume | 1250.17 ± 0.12 Å3 |
Cell temperature | 100 ± 2 K |
Ambient diffraction temperature | 100 ± 2 K |
Number of distinct elements | 7 |
Space group number | 2 |
Hermann-Mauguin space group symbol | P -1 |
Hall space group symbol | -P 1 |
Residual factor for all reflections | 0.0224 |
Residual factor for significantly intense reflections | 0.0198 |
Weighted residual factors for significantly intense reflections | 0.0373 |
Weighted residual factors for all reflections included in the refinement | 0.0382 |
Goodness-of-fit parameter for all reflections included in the refinement | 1.054 |
Diffraction radiation wavelength | 0.71073 Å |
Diffraction radiation type | MoKα |