Information card for entry 4346083
Formula | C21 H15 Cl3 N4 O Pt |
Calculated formula | C21 H15 Cl3 N4 O Pt |
SMILES | [Pt]12(N(OC(=[NH]1)c1ccccc1Cl)C(=NC(=[NH]2)c1ccccc1Cl)c1ccccc1)Cl |
Title of publication | Bifunctional reactivity of amidoximes observed upon nucleophilic addition to metal-activated nitriles. |
Authors of publication | Bolotin, Dmitrii S.; Demakova, Marina Ya; Novikov, Alexander S.; Avdontceva, Margarita S.; Kuznetsov, Maxim L.; Bokach, Nadezhda A.; Kukushkin, Vadim Yu |
Journal of publication | Inorganic chemistry |
Year of publication | 2015 |
Journal volume | 54 |
Journal issue | 8 |
Pages of publication | 4039 - 4046 |
a | 12.6194 ± 0.0002 Å |
b | 12.97886 ± 0.00015 Å |
c | 13.7917 ± 0.0002 Å |
α | 90° |
β | 109.888 ± 0.0018° |
γ | 90° |
Cell volume | 2124.15 ± 0.06 Å3 |
Cell temperature | 100 ± 2 K |
Ambient diffraction temperature | 100 ± 2 K |
Number of distinct elements | 6 |
Space group number | 14 |
Hermann-Mauguin space group symbol | P 1 21/n 1 |
Hall space group symbol | -P 2yn |
Residual factor for all reflections | 0.0451 |
Residual factor for significantly intense reflections | 0.04 |
Weighted residual factors for significantly intense reflections | 0.0744 |
Weighted residual factors for all reflections included in the refinement | 0.0781 |
Goodness-of-fit parameter for all reflections included in the refinement | 1.051 |
Diffraction radiation wavelength | 1.54184 Å |
Diffraction radiation type | CuKα |