Information card for entry 4346090
Formula | C8 H14 Cs2 O18 V2 |
Calculated formula | C8 H14 Cs2 O18 V2 |
Title of publication | Crystal growth of four oxovanadium(IV) tartrates prepared via a mild two-step hydrothermal method: observation of spin-dimer behavior and second harmonic generation. |
Authors of publication | Cortese, Anthony J.; Wilkins, Branford; Smith, Mark D.; Yeon, Jeongho; Morrison, Gregory; Tran, T. Thao; Halasyamani, P. Shiv; zur Loye, Hans-Conrad |
Journal of publication | Inorganic chemistry |
Year of publication | 2015 |
Journal volume | 54 |
Journal issue | 8 |
Pages of publication | 4011 - 4020 |
a | 8.032 ± 0.0006 Å |
b | 10.4016 ± 0.0008 Å |
c | 23.3623 ± 0.0017 Å |
α | 90° |
β | 90° |
γ | 90° |
Cell volume | 1951.8 ± 0.3 Å3 |
Cell temperature | 100 ± 2 K |
Ambient diffraction temperature | 100 ± 2 K |
Number of distinct elements | 5 |
Space group number | 19 |
Hermann-Mauguin space group symbol | P 21 21 21 |
Hall space group symbol | P 2ac 2ab |
Residual factor for all reflections | 0.0223 |
Residual factor for significantly intense reflections | 0.021 |
Weighted residual factors for significantly intense reflections | 0.0478 |
Weighted residual factors for all reflections included in the refinement | 0.0487 |
Goodness-of-fit parameter for all reflections included in the refinement | 1.06 |
Diffraction radiation wavelength | 0.71073 Å |
Diffraction radiation type | MoKα |