Information card for entry 4346091
Formula | C8 H14 O18 Rb2 V2 |
Calculated formula | C8 H14 O18 Rb2 V2 |
Title of publication | Crystal growth of four oxovanadium(IV) tartrates prepared via a mild two-step hydrothermal method: observation of spin-dimer behavior and second harmonic generation. |
Authors of publication | Cortese, Anthony J.; Wilkins, Branford; Smith, Mark D.; Yeon, Jeongho; Morrison, Gregory; Tran, T. Thao; Halasyamani, P. Shiv; zur Loye, Hans-Conrad |
Journal of publication | Inorganic chemistry |
Year of publication | 2015 |
Journal volume | 54 |
Journal issue | 8 |
Pages of publication | 4011 - 4020 |
a | 7.9061 ± 0.0008 Å |
b | 10.2647 ± 0.0011 Å |
c | 22.814 ± 0.002 Å |
α | 90° |
β | 90° |
γ | 90° |
Cell volume | 1851.4 ± 0.3 Å3 |
Cell temperature | 100 ± 2 K |
Ambient diffraction temperature | 100 ± 2 K |
Number of distinct elements | 5 |
Space group number | 19 |
Hermann-Mauguin space group symbol | P 21 21 21 |
Hall space group symbol | P 2ac 2ab |
Residual factor for all reflections | 0.027 |
Residual factor for significantly intense reflections | 0.0238 |
Weighted residual factors for significantly intense reflections | 0.0527 |
Weighted residual factors for all reflections included in the refinement | 0.0543 |
Goodness-of-fit parameter for all reflections included in the refinement | 1.05 |
Diffraction radiation wavelength | 0.71073 Å |
Diffraction radiation type | MoKα |