Information card for entry 4346098
Formula | C10 H14 Br6 N Ta |
Calculated formula | C10 H14 Br6 N Ta |
SMILES | Br[Ta](Br)(Br)(Br)(Br)[Br-].C[N+](C)=CCc1ccccc1 |
Title of publication | Synthesis of α-amino acidato derivatives of niobium and tantalum pentahalides and their conversion into iminium salts. |
Authors of publication | Bortoluzzi, Marco; Hayatifar, Mohammad; Marchetti, Fabio; Pampaloni, Guido; Zacchini, Stefano |
Journal of publication | Inorganic chemistry |
Year of publication | 2015 |
Journal volume | 54 |
Journal issue | 8 |
Pages of publication | 4047 - 4055 |
a | 42.859 ± 0.006 Å |
b | 7.2764 ± 0.0011 Å |
c | 17.012 ± 0.002 Å |
α | 90° |
β | 90° |
γ | 90° |
Cell volume | 5305.3 ± 1.3 Å3 |
Cell temperature | 100 ± 2 K |
Ambient diffraction temperature | 100 ± 2 K |
Number of distinct elements | 5 |
Space group number | 29 |
Hermann-Mauguin space group symbol | P c a 21 |
Hall space group symbol | P 2c -2ac |
Residual factor for all reflections | 0.059 |
Residual factor for significantly intense reflections | 0.0469 |
Weighted residual factors for significantly intense reflections | 0.1054 |
Weighted residual factors for all reflections included in the refinement | 0.1101 |
Goodness-of-fit parameter for all reflections included in the refinement | 1.072 |
Diffraction radiation wavelength | 0.71073 Å |
Diffraction radiation type | MoKα |