Information card for entry 4346099
Formula | C81 H113 La2 N11 O9 |
Calculated formula | C75 H92 La2 N11 O9 |
Title of publication | Lanthanide(III) di- and tetra-nuclear complexes supported by a chelating tripodal tris(amidate) ligand. |
Authors of publication | Brown, Jessie L.; Jones, Matthew B.; Gaunt, Andrew J.; Scott, Brian L.; MacBeth, Cora E.; Gordon, John C. |
Journal of publication | Inorganic chemistry |
Year of publication | 2015 |
Journal volume | 54 |
Journal issue | 8 |
Pages of publication | 4064 - 4075 |
a | 30.618 ± 0.002 Å |
b | 12.2582 ± 0.0009 Å |
c | 23.3809 ± 0.0017 Å |
α | 90° |
β | 111.653 ± 0.001° |
γ | 90° |
Cell volume | 8156.1 ± 1 Å3 |
Cell temperature | 120 ± 1 K |
Ambient diffraction temperature | 120 ± 1 K |
Number of distinct elements | 5 |
Space group number | 15 |
Hermann-Mauguin space group symbol | C 1 2/c 1 |
Hall space group symbol | -C 2yc |
Residual factor for all reflections | 0.0453 |
Residual factor for significantly intense reflections | 0.036 |
Weighted residual factors for significantly intense reflections | 0.0987 |
Weighted residual factors for all reflections included in the refinement | 0.1023 |
Goodness-of-fit parameter for all reflections included in the refinement | 1.284 |
Diffraction radiation wavelength | 0.71073 Å |
Diffraction radiation type | MoKα |