Information card for entry 4346100
Formula | C81 H113 Ce2 N11 O9 |
Calculated formula | C75 H86 Ce2 N10.999 O9 |
Title of publication | Lanthanide(III) di- and tetra-nuclear complexes supported by a chelating tripodal tris(amidate) ligand. |
Authors of publication | Brown, Jessie L.; Jones, Matthew B.; Gaunt, Andrew J.; Scott, Brian L.; MacBeth, Cora E.; Gordon, John C. |
Journal of publication | Inorganic chemistry |
Year of publication | 2015 |
Journal volume | 54 |
Journal issue | 8 |
Pages of publication | 4064 - 4075 |
a | 30.497 ± 0.004 Å |
b | 12.2527 ± 0.0016 Å |
c | 23.36 ± 0.003 Å |
α | 90° |
β | 111.787 ± 0.001° |
γ | 90° |
Cell volume | 8105.4 ± 1.8 Å3 |
Cell temperature | 120 ± 1 K |
Ambient diffraction temperature | 120 ± 1 K |
Number of distinct elements | 5 |
Space group number | 15 |
Hermann-Mauguin space group symbol | C 1 2/c 1 |
Hall space group symbol | -C 2yc |
Residual factor for all reflections | 0.0488 |
Residual factor for significantly intense reflections | 0.037 |
Weighted residual factors for significantly intense reflections | 0.1018 |
Weighted residual factors for all reflections included in the refinement | 0.1055 |
Goodness-of-fit parameter for all reflections included in the refinement | 1.262 |
Diffraction radiation wavelength | 0.71073 Å |
Diffraction radiation type | MoKα |