Information card for entry 4346102
Formula | C162 H226 Ce4 N16 O12 |
Calculated formula | C132 H156 Ce4 N16 O12 |
Title of publication | Lanthanide(III) di- and tetra-nuclear complexes supported by a chelating tripodal tris(amidate) ligand. |
Authors of publication | Brown, Jessie L.; Jones, Matthew B.; Gaunt, Andrew J.; Scott, Brian L.; MacBeth, Cora E.; Gordon, John C. |
Journal of publication | Inorganic chemistry |
Year of publication | 2015 |
Journal volume | 54 |
Journal issue | 8 |
Pages of publication | 4064 - 4075 |
a | 67.248 ± 0.012 Å |
b | 15.982 ± 0.003 Å |
c | 30.73 ± 0.006 Å |
α | 90° |
β | 108.002 ± 0.002° |
γ | 90° |
Cell volume | 31410 ± 10 Å3 |
Cell temperature | 120 ± 1 K |
Ambient diffraction temperature | 120 ± 1 K |
Number of distinct elements | 5 |
Space group number | 15 |
Hermann-Mauguin space group symbol | C 1 2/c 1 |
Hall space group symbol | -C 2yc |
Residual factor for all reflections | 0.0758 |
Residual factor for significantly intense reflections | 0.0449 |
Weighted residual factors for significantly intense reflections | 0.0963 |
Weighted residual factors for all reflections included in the refinement | 0.106 |
Goodness-of-fit parameter for all reflections included in the refinement | 0.915 |
Diffraction radiation wavelength | 0.71073 Å |
Diffraction radiation type | MoKα |