Information card for entry 4346103
Formula | C162 H226 N16 Nd4 O12 |
Calculated formula | C132 H153 N16 Nd4 O12 |
Title of publication | Lanthanide(III) di- and tetra-nuclear complexes supported by a chelating tripodal tris(amidate) ligand. |
Authors of publication | Brown, Jessie L.; Jones, Matthew B.; Gaunt, Andrew J.; Scott, Brian L.; MacBeth, Cora E.; Gordon, John C. |
Journal of publication | Inorganic chemistry |
Year of publication | 2015 |
Journal volume | 54 |
Journal issue | 8 |
Pages of publication | 4064 - 4075 |
a | 67.241 ± 0.003 Å |
b | 15.9016 ± 0.0006 Å |
c | 30.5419 ± 0.0016 Å |
α | 90° |
β | 108.905 ± 0.002° |
γ | 90° |
Cell volume | 30895 ± 2 Å3 |
Cell temperature | 120 ± 0 K |
Ambient diffraction temperature | 120 ± 0 K |
Number of distinct elements | 5 |
Space group number | 15 |
Hermann-Mauguin space group symbol | C 1 2/c 1 |
Hall space group symbol | -C 2yc |
Residual factor for all reflections | 0.1417 |
Residual factor for significantly intense reflections | 0.0675 |
Weighted residual factors for significantly intense reflections | 0.1396 |
Weighted residual factors for all reflections included in the refinement | 0.1598 |
Goodness-of-fit parameter for all reflections included in the refinement | 0.895 |
Diffraction radiation wavelength | 0.71073 Å |
Diffraction radiation type | MoKα |