Information card for entry 4346125
Formula | C5 H11 Cu2 I2 N S |
Calculated formula | C5 H11 Cu2 I2 N S |
Title of publication | Reactivity of CuI and CuBr toward dialkyl sulfides RSR: from discrete molecular Cu4I4S4 and Cu8I8S6 clusters to luminescent copper(I) coordination polymers. |
Authors of publication | Knorr, Michael; Bonnot, Antoine; Lapprand, Antony; Khatyr, Abderrahim; Strohmann, Carsten; Kubicki, Marek M.; Rousselin, Yoann; Harvey, Pierre D. |
Journal of publication | Inorganic chemistry |
Year of publication | 2015 |
Journal volume | 54 |
Journal issue | 8 |
Pages of publication | 4076 - 4093 |
a | 7.2263 ± 0.0006 Å |
b | 10.4398 ± 0.0008 Å |
c | 16.0553 ± 0.0011 Å |
α | 90° |
β | 90.326 ± 0.002° |
γ | 90° |
Cell volume | 1211.21 ± 0.16 Å3 |
Cell temperature | 115 K |
Ambient diffraction temperature | 115 K |
Number of distinct elements | 6 |
Space group number | 14 |
Hermann-Mauguin space group symbol | P 1 21/c 1 |
Hall space group symbol | -P 2ybc |
Residual factor for all reflections | 0.0202 |
Residual factor for significantly intense reflections | 0.0151 |
Weighted residual factors for significantly intense reflections | 0.029 |
Weighted residual factors for all reflections included in the refinement | 0.0304 |
Goodness-of-fit parameter for all reflections included in the refinement | 1.044 |
Diffraction radiation probe | x-ray |
Diffraction radiation wavelength | 0.71073 Å |
Diffraction radiation type | MoKα~1~ |
Diffraction radiation X-ray symbol | K-L~3~ |