Information card for entry 4346126
Formula | C9 H24 Cu4 I4 S3 |
Calculated formula | C9 H24 Cu4 I4 S3 |
Title of publication | Reactivity of CuI and CuBr toward dialkyl sulfides RSR: from discrete molecular Cu4I4S4 and Cu8I8S6 clusters to luminescent copper(I) coordination polymers. |
Authors of publication | Knorr, Michael; Bonnot, Antoine; Lapprand, Antony; Khatyr, Abderrahim; Strohmann, Carsten; Kubicki, Marek M.; Rousselin, Yoann; Harvey, Pierre D. |
Journal of publication | Inorganic chemistry |
Year of publication | 2015 |
Journal volume | 54 |
Journal issue | 8 |
Pages of publication | 4076 - 4093 |
a | 11.1889 ± 0.0003 Å |
b | 12.5095 ± 0.0003 Å |
c | 33.9283 ± 0.0008 Å |
α | 90° |
β | 90° |
γ | 90° |
Cell volume | 4748.9 ± 0.2 Å3 |
Cell temperature | 115 K |
Ambient diffraction temperature | 115 K |
Number of distinct elements | 5 |
Space group number | 61 |
Hermann-Mauguin space group symbol | P b c a |
Hall space group symbol | -P 2ac 2ab |
Residual factor for all reflections | 0.0981 |
Residual factor for significantly intense reflections | 0.0961 |
Weighted residual factors for significantly intense reflections | 0.2273 |
Weighted residual factors for all reflections included in the refinement | 0.2281 |
Goodness-of-fit parameter for all reflections included in the refinement | 1.307 |
Diffraction radiation probe | x-ray |
Diffraction radiation wavelength | 0.71073 Å |
Diffraction radiation type | MoKα |