Information card for entry 4346127
Formula | C20 H48 Cu4 I4 S4 |
Calculated formula | C20 H48 Cu4 I4 S4 |
Title of publication | Reactivity of CuI and CuBr toward dialkyl sulfides RSR: from discrete molecular Cu4I4S4 and Cu8I8S6 clusters to luminescent copper(I) coordination polymers. |
Authors of publication | Knorr, Michael; Bonnot, Antoine; Lapprand, Antony; Khatyr, Abderrahim; Strohmann, Carsten; Kubicki, Marek M.; Rousselin, Yoann; Harvey, Pierre D. |
Journal of publication | Inorganic chemistry |
Year of publication | 2015 |
Journal volume | 54 |
Journal issue | 8 |
Pages of publication | 4076 - 4093 |
a | 15.1013 ± 0.0006 Å |
b | 15.4882 ± 0.0004 Å |
c | 15.5085 ± 0.0005 Å |
α | 90° |
β | 90° |
γ | 90° |
Cell volume | 3627.3 ± 0.2 Å3 |
Cell temperature | 115 ± 2 K |
Ambient diffraction temperature | 115 ± 2 K |
Number of distinct elements | 5 |
Space group number | 60 |
Hermann-Mauguin space group symbol | P b c n |
Hall space group symbol | -P 2n 2ab |
Residual factor for all reflections | 0.0732 |
Residual factor for significantly intense reflections | 0.0636 |
Weighted residual factors for significantly intense reflections | 0.1464 |
Weighted residual factors for all reflections included in the refinement | 0.1531 |
Goodness-of-fit parameter for all reflections included in the refinement | 1.077 |
Diffraction radiation wavelength | 0.71069 Å |
Diffraction radiation type | MoKα |