Information card for entry 4346136
Formula | C12 H20 Cl N3 O9 P2 Pt |
Calculated formula | C12 H20 Cl N3 O9 P2 Pt |
Title of publication | Unusual Example of Chelate Ring Opening upon Coordination of the 9-Ethylguanine Nucleobase to [Pt(di-(6-methyl-2-picolyl)amine)Cl]Cl. |
Authors of publication | Andrepont, Chase; Pakhomova, Svetlana; Marzilli, Patricia A.; Marzilli, Luigi G. |
Journal of publication | Inorganic chemistry |
Year of publication | 2015 |
Journal volume | 54 |
Journal issue | 10 |
Pages of publication | 4895 - 4908 |
a | 6.9872 ± 0.0002 Å |
b | 12.063 ± 0.0004 Å |
c | 12.8337 ± 0.0004 Å |
α | 114.212 ± 0.002° |
β | 91.53 ± 0.002° |
γ | 102.012 ± 0.002° |
Cell volume | 957.31 ± 0.05 Å3 |
Cell temperature | 100 ± 2 K |
Ambient diffraction temperature | 100 ± 2 K |
Number of distinct elements | 7 |
Space group number | 2 |
Hermann-Mauguin space group symbol | P -1 |
Hall space group symbol | -P 1 |
Residual factor for all reflections | 0.0432 |
Residual factor for significantly intense reflections | 0.0316 |
Weighted residual factors for significantly intense reflections | 0.0645 |
Weighted residual factors for all reflections included in the refinement | 0.068 |
Goodness-of-fit parameter for all reflections included in the refinement | 1.019 |
Diffraction radiation wavelength | 0.71073 Å |
Diffraction radiation type | MoKα |