Information card for entry 4346137
Formula | C14 H17 Cl2 N3 Pt |
Calculated formula | C14 H17 Cl2 N3 Pt |
Title of publication | Unusual Example of Chelate Ring Opening upon Coordination of the 9-Ethylguanine Nucleobase to [Pt(di-(6-methyl-2-picolyl)amine)Cl]Cl. |
Authors of publication | Andrepont, Chase; Pakhomova, Svetlana; Marzilli, Patricia A.; Marzilli, Luigi G. |
Journal of publication | Inorganic chemistry |
Year of publication | 2015 |
Journal volume | 54 |
Journal issue | 10 |
Pages of publication | 4895 - 4908 |
a | 15.6698 ± 0.0009 Å |
b | 6.8167 ± 0.0004 Å |
c | 14.2516 ± 0.0008 Å |
α | 90° |
β | 90° |
γ | 90° |
Cell volume | 1522.3 ± 0.15 Å3 |
Cell temperature | 98 ± 2 K |
Ambient diffraction temperature | 98 ± 2 K |
Number of distinct elements | 5 |
Space group number | 62 |
Hermann-Mauguin space group symbol | P n m a |
Hall space group symbol | -P 2ac 2n |
Residual factor for all reflections | 0.0401 |
Residual factor for significantly intense reflections | 0.0337 |
Weighted residual factors for significantly intense reflections | 0.0675 |
Weighted residual factors for all reflections included in the refinement | 0.0693 |
Goodness-of-fit parameter for all reflections included in the refinement | 1.252 |
Diffraction radiation wavelength | 0.71073 Å |
Diffraction radiation type | MoKα |