Information card for entry 4346141
Common name | in manuscript 3c |
Formula | C34 H46 Cl4 N2 P2 Ru |
Calculated formula | C34 H46 Cl4 N2 P2 Ru |
SMILES | [Ru]1(Cl)(Cl)([P](N2C=1N(C=C2)C(C)(C)C)(C(C)(C)C)C(C)(C)C)[P](c1ccccc1)(c1ccccc1)c1ccccc1.C(Cl)Cl |
Title of publication | Bulky N-Phosphino-Functionalized N-Heterocyclic Carbene Ligands: Synthesis, Ruthenium Coordination Chemistry, and Ruthenium Alkylidene Complexes for Olefin Metathesis. |
Authors of publication | Brown, Christopher C.; Rominger, Frank; Limbach, Michael; Hofmann, Peter |
Journal of publication | Inorganic chemistry |
Year of publication | 2015 |
Journal volume | 54 |
Journal issue | 21 |
Pages of publication | 10126 - 10140 |
a | 10.557 ± 0.001 Å |
b | 17.4081 ± 0.0017 Å |
c | 19.9446 ± 0.0018 Å |
α | 90° |
β | 91.141 ± 0.002° |
γ | 90° |
Cell volume | 3664.6 ± 0.6 Å3 |
Cell temperature | 200 ± 2 K |
Ambient diffraction temperature | 200 ± 2 K |
Number of distinct elements | 6 |
Space group number | 4 |
Hermann-Mauguin space group symbol | P 1 21 1 |
Hall space group symbol | P 2yb |
Residual factor for all reflections | 0.1421 |
Residual factor for significantly intense reflections | 0.0765 |
Weighted residual factors for significantly intense reflections | 0.1059 |
Weighted residual factors for all reflections included in the refinement | 0.1268 |
Goodness-of-fit parameter for all reflections included in the refinement | 1.031 |
Diffraction radiation wavelength | 0.71073 Å |
Diffraction radiation type | MoKα |