Information card for entry 4346142
Common name | in manuscript 4aH |
Formula | C24 H37 Cl6 N4 P Ru |
Calculated formula | C24 H37 Cl6 N4 P Ru |
SMILES | [Ru]1(Cl)(Cl)([P](N2C=1N(C=C2)C)(C(C)(C)C)C(C)(C)C)([n]1ccccc1)[n]1ccccc1.C(Cl)Cl.C(Cl)Cl |
Title of publication | Bulky N-Phosphino-Functionalized N-Heterocyclic Carbene Ligands: Synthesis, Ruthenium Coordination Chemistry, and Ruthenium Alkylidene Complexes for Olefin Metathesis. |
Authors of publication | Brown, Christopher C.; Rominger, Frank; Limbach, Michael; Hofmann, Peter |
Journal of publication | Inorganic chemistry |
Year of publication | 2015 |
Journal volume | 54 |
Journal issue | 21 |
Pages of publication | 10126 - 10140 |
a | 8.6967 ± 0.0007 Å |
b | 15.776 ± 0.0012 Å |
c | 22.6971 ± 0.0017 Å |
α | 90° |
β | 93.707 ± 0.001° |
γ | 90° |
Cell volume | 3107.5 ± 0.4 Å3 |
Cell temperature | 199 ± 2 K |
Ambient diffraction temperature | 199 ± 2 K |
Number of distinct elements | 6 |
Space group number | 14 |
Hermann-Mauguin space group symbol | P 1 21/c 1 |
Hall space group symbol | -P 2ybc |
Residual factor for all reflections | 0.06 |
Residual factor for significantly intense reflections | 0.0376 |
Weighted residual factors for significantly intense reflections | 0.0735 |
Weighted residual factors for all reflections included in the refinement | 0.0811 |
Goodness-of-fit parameter for all reflections included in the refinement | 1.035 |
Diffraction radiation wavelength | 0.71073 Å |
Diffraction radiation type | MoKα |