Information card for entry 4346156
Formula | C29 H45 Br2 F6 N4 P Zn |
Calculated formula | C29 H45 Br2 F6 N4 P Zn |
SMILES | Br[Zn]12(Br)[N](=C(C)c3[n]1c(ccc3)C(=[N]2CC[NH+](C(C)C)C(C)C)C)c1c(cccc1C(C)C)C(C)C.[P](F)(F)(F)(F)(F)[F-] |
Title of publication | Probing the Protonation State and the Redox-Active Sites of Pendant Base Iron(II) and Zinc(II) Pyridinediimine Complexes. |
Authors of publication | Delgado, Mayra; Sommer, Samantha K.; Swanson, Seth P.; Berger, Robert F.; Seda, Takele; Zakharov, Lev N.; Gilbertson, John D. |
Journal of publication | Inorganic chemistry |
Year of publication | 2015 |
Journal volume | 54 |
Journal issue | 15 |
Pages of publication | 7239 - 7248 |
a | 22.9535 ± 0.0012 Å |
b | 8.2584 ± 0.0004 Å |
c | 20.1565 ± 0.001 Å |
α | 90° |
β | 110.834 ± 0.004° |
γ | 90° |
Cell volume | 3571 ± 0.3 Å3 |
Cell temperature | 223 ± 2 K |
Ambient diffraction temperature | 223 ± 2 K |
Number of distinct elements | 7 |
Space group number | 14 |
Hermann-Mauguin space group symbol | P 1 21/c 1 |
Hall space group symbol | -P 2ybc |
Residual factor for all reflections | 0.0591 |
Residual factor for significantly intense reflections | 0.0396 |
Weighted residual factors for significantly intense reflections | 0.0918 |
Weighted residual factors for all reflections included in the refinement | 0.0994 |
Goodness-of-fit parameter for all reflections included in the refinement | 1.003 |
Diffraction radiation wavelength | 1.54178 Å |
Diffraction radiation type | CuKα |