Information card for entry 4346157
Formula | C31 H44 Fe N4 O2 |
Calculated formula | C31 H44 Fe N4 O2 |
SMILES | [Fe]12([N](=C(C)c3[n]1c(ccc3)C(=[N]2CCN(C(C)C)C(C)C)C)c1c(cccc1C(C)C)C(C)C)(C#[O])C#[O] |
Title of publication | Probing the Protonation State and the Redox-Active Sites of Pendant Base Iron(II) and Zinc(II) Pyridinediimine Complexes. |
Authors of publication | Delgado, Mayra; Sommer, Samantha K.; Swanson, Seth P.; Berger, Robert F.; Seda, Takele; Zakharov, Lev N.; Gilbertson, John D. |
Journal of publication | Inorganic chemistry |
Year of publication | 2015 |
Journal volume | 54 |
Journal issue | 15 |
Pages of publication | 7239 - 7248 |
a | 9.968 ± 0.002 Å |
b | 12.541 ± 0.003 Å |
c | 24.039 ± 0.005 Å |
α | 90° |
β | 97.438 ± 0.003° |
γ | 90° |
Cell volume | 2979.8 ± 1.1 Å3 |
Cell temperature | 173 ± 2 K |
Ambient diffraction temperature | 173 ± 2 K |
Number of distinct elements | 5 |
Space group number | 14 |
Hermann-Mauguin space group symbol | P 1 21/c 1 |
Hall space group symbol | -P 2ybc |
Residual factor for all reflections | 0.0991 |
Residual factor for significantly intense reflections | 0.0846 |
Weighted residual factors for significantly intense reflections | 0.1824 |
Weighted residual factors for all reflections included in the refinement | 0.1916 |
Goodness-of-fit parameter for all reflections included in the refinement | 1.273 |
Diffraction radiation wavelength | 0.71073 Å |
Diffraction radiation type | MoKα |