Information card for entry 4346172
Formula | C38 H48 Co N2 O4 |
Calculated formula | C38 H48 Co N2 O4 |
SMILES | c12c(ccc(c2O[Co]23(O1)([n]1ccccc1c1[n]2cccc1)Oc1c(c(ccc1C(C)(C)C)C(C)(C)C)O3)C(C)(C)C)C(C)(C)C |
Title of publication | Lattice-Modulated Phase Transition Coupled with Redox-Isomeric Interconversion of o-Semiquinone-Catecholato into Bis(o-semiquinonato) Cobalt Complexes. |
Authors of publication | Bubnov, Michael P.; Skorodumova, Nina A.; Arapova, Alla V.; Smirnova, Natalia N.; Samsonov, Maxim A.; Fukin, Georgy K.; Cherkasov, Vladimir K.; Abakumov, Gleb A. |
Journal of publication | Inorganic chemistry |
Year of publication | 2015 |
Journal volume | 54 |
Journal issue | 16 |
Pages of publication | 7767 - 7773 |
a | 10.6666 ± 0.0004 Å |
b | 29.4989 ± 0.001 Å |
c | 11.9245 ± 0.0004 Å |
α | 90° |
β | 112.564 ± 0.004° |
γ | 90° |
Cell volume | 3464.9 ± 0.2 Å3 |
Cell temperature | 100 ± 2 K |
Ambient diffraction temperature | 100 ± 2 K |
Number of distinct elements | 5 |
Space group number | 15 |
Hermann-Mauguin space group symbol | C 1 2/c 1 |
Hall space group symbol | -C 2yc |
Residual factor for all reflections | 0.0822 |
Residual factor for significantly intense reflections | 0.0494 |
Weighted residual factors for significantly intense reflections | 0.0844 |
Weighted residual factors for all reflections included in the refinement | 0.092 |
Goodness-of-fit parameter for all reflections included in the refinement | 1.017 |
Diffraction radiation wavelength | 0.71073 Å |
Diffraction radiation type | MoKα |